{"text_format":"1","workbook":"xlsx","n_sheets":13,"sheets":["INICIO","AJUDA","MACROS VBA","LANCAMENTOS","CADPRO","CADCLI","MOVTO","TABELAS","DISP","HIST_PRODUTO","ABC_PRODUTO","ABC_CLIENTE","XX"],"not_rendered":{"charts":0,"images":1,"macros":1,"external_links":0,"defined_names":8,"comments":1,"pivot_tables":0},"unopened":[],"bounds":{"document_bytes":16777216,"sheet_cells":100000,"rows_first":2000,"rows_last":500,"rows_between":2000,"halvings":0,"cell_chars":16384,"cell_head_chars":4096},"cells_cut":0,"cells_raw":0,"read":"whole","date_system":"1900"}

{"sheet":"INICIO","index":0,"n_rows":35,"n_cols":2,"rows_kept":35,"cut":false,"hidden":false,"merged":[[3,1,3,3],[3,5,3,8],[0,1,0,8]]}
[null,"CONTROLE DE ESTOQUE"]
[null,"Desenvolvido por"]
[null,"Janalista.com.br  04/2024"]
[]
[null,"M E N U "]
[]
[]
[]
[]
[]
[]
[]
[]
[]
[]
[]
[]
[]
[]
[]
[]
[]
[]
[]
[]
[]
[]
[]
[]
[]
[]
[]
[]
[null,"CONTATO"]
[null,"janalista@terra.com.br"]

{"sheet":"AJUDA","index":1,"n_rows":0,"n_cols":0,"rows_kept":0,"cut":false,"hidden":false,"merged":[]}

{"sheet":"MACROS VBA","index":2,"n_rows":0,"n_cols":0,"rows_kept":0,"cut":false,"hidden":false,"merged":[]}

{"sheet":"LANCAMENTOS","index":3,"n_rows":165,"n_cols":11,"rows_kept":165,"cut":false,"hidden":false,"merged":[[21,2,21,5],[3,1,3,3],[2,4,2,6],[0,0,0,7],[1,1,1,7],[15,4,15,5],[17,4,17,5]]}
[]
[null,"LANÇAMENTOS DE ENTRADAS / SAÍDAS"]
[null,null,null,null,"DATA MOVIMENTO:",null,null,{"$f":"TODAY()","v":"2024-04-17"}]
[]
[]
[null,"Data:",{"$f":"H3","v":"2024-04-17"}]
[]
[null,"Tipo Operação:","",null,{"$f":"VLOOKUP(C8,TABELAS!F5:J9997,2,FALSE)","v":{"$error":"#N/A"}},{"$f":"VLOOKUP(C8,TABELAS!F5:J9997,3,FALSE)","v":{"$error":"#N/A"}},{"$f":"VLOOKUP(C8,TABELAS!F5:J9997,4,FALSE)","v":{"$error":"#N/A"}},{"$f":"VLOOKUP(C8,TABELAS!F5:J9997,5,FALSE)","v":{"$error":"#N/A"}}]
[null,null,null,null,null,"Descrição","Unid","Qtde em Estoque","Valor em estoque"]
[null,"Produto:",null,null,{"$f":"VLOOKUP(C10,CADPRO!A4:H9989,1,FALSE)","v":{"$error":"#N/A"}},{"$f":"VLOOKUP(C10,CADPRO!A4:H9989,2,FALSE)","v":{"$error":"#N/A"}},{"$f":"VLOOKUP(C10,CADPRO!A4:H9989,3,FALSE)","v":{"$error":"#N/A"}},{"$f":"VLOOKUP(C10,CADPRO!A4:H9989,5,FALSE)","v":{"$error":"#N/A"}},{"$f":"VLOOKUP(C10,CADPRO!A4:H9989,6,FALSE)","v":{"$error":"#N/A"}},{"$f":"VLOOKUP(C10,CADPRO!A4:H9989,5,FALSE)","v":{"$error":"#N/A"}},{"$f":"VLOOKUP(C10,CADPRO!A4:H9989,5,FALSE)","v":{"$error":"#N/A"}}]
[]
[null,"Cliente/Fornec.","",null,null,{"$f":"VLOOKUP(C12,CADCLI!A4:H9988,2,FALSE)","v":{"$error":"#N/A"}}]
[]
[null,"Qtd.Movto:"]
[]
[null,"Valor Movimento:",null,null,"Informe somente para lançamentos de entrada"]
[]
["","Valor Venda:",null,null,"Informe somente p/ lançamentos de venda"]
[]
[null,"Documento:",""]
[]
[null,"Descrição Movto"]
[]
[]
[]
[]
[]
[]
[]
[]
[]
[]
[]
[]
[]
[]
[]
[]
[]
[]
[]
[]
[]
[]
[]
[]
[]
[]
[]
[]
[]
[]
[]
[]
[]
[]
[]
[]
[]
[]
[]
[]
[]
[]
[]
[]
[]
[]
[]
[]
[]
[]
[]
[]
[]
[]
[]
[]
[]
[]
[]
[]
[]
[]
[]
[]
[]
[]
[]
[]
[]
[]
[]
[]
[]
[]
[]
[]
[]
[]
[]
[]
[]
[]
[]
[]
[]
[]
[]
[]
[]
[]
[]
[]
[]
[]
[]
[]
[]
[]
[]
[]
[]
[]
[]
[]
[]
[]
[]
[]
[]
[]
[]
[]
[]
[]
[]
[]
[]
[]
[]
[]
[]
[]
[]
[]
[]
[]
[]
[]
[]
[]
[]
[]
[]
[]
[]
[]
[]
[]
[]
[]
[]
[]
[null,null,"1902-09-25"]

{"sheet":"CADPRO","index":4,"n_rows":13,"n_cols":13,"rows_kept":13,"cut":false,"hidden":false,"merged":[[1,0,1,12]]}
[]
["CADASTRO DE PRODUTOS  - BASE DE DADOS"]
["Codigo","Descrição","Unid","Grupo","Qtde. Estoque","Valor Estoque","Preço Compra","Preço Venda","Tempo Reposição (dias)","Consumo mensal","Est. Minimo (dias)","Est. Maximo (dias)","Sit"]
["BA-023","CAIXA ACOPLADA PARA VASO SANITÁRIO","PC","HIDRAULICOS",15,2100,"56,20","85,50",7,10,10,30,"A"]
["CH-P005","PISO CERAMICO MARMORIZADO","M2","HIDRAULICOS",200,700,null,"30,00",20,2,3,30,"A"]
["CH-P20-003","PORCELANATO CIMENTICIO","M2","HIDRAULICOS",62,1340,null,"55,00",10,3,10,30,"A"]
["COZ-003","CUBA COZINHA LUXO INOX","PC","HIDRAULICOS",15,3580,"220,00","280,00",10,5,2,30,"A"]
["CRGR-020","CORTADOR DE GRAMA MOD. CTA-020 - 220 V.","PC","JARDIM",5,"1500,00","250,00","325,00",15,3,4,8,"A"]
["J003-XLS","GRIL ELÉTRICO GIRATÓRIO AÇO","PC","ELÉTRICO",47,13300,400,"650,00",20,5,10,30,"A"]
["K-BA004","KIT/ACESSÓRIOS BANHEIRO (4 PÇS)","UN","HIDRAULICOS",23,"6300,00","180,00","250,00",3,4,2,30,"A"]
["LAMLED-045","LAMPADA LED BULBO 220 V.","UN","ELÉTRICO",78,799.5,"7,80","13,00",15,40,25,60,"A"]
["LULE- BK37","TOMADA DE PAREDE - 220 V.","PC","ELÉTRICO",12,"480,50","45,00","72,00",15,6,15,90,"A"]
["TACR001","TINTA ACRILICA PREMIUM - COR MARROM - GALÃO","LT","TINTAS",85,2313.8888888888887,"29,00","35,00",7,36,12,90,"A"]

{"sheet":"CADCLI","index":5,"n_rows":14,"n_cols":12,"rows_kept":14,"cut":false,"hidden":false,"merged":[[1,0,1,11]]}
[]
["CADASTRO DE CLIENTES - BASE DE DADOS"]
["IDENTIFICAÇÃO","NOME","ENDEREÇO","BAIRRO","CEP","MUNICIPIO","EST","TELEFONE","CELULAR","MAIL","CNPJ/CPJ","SIT"]
["_DIVERSOS","DIVERSOS","GERAL","GERAL","00000-000","Brasil","SP",null,null,null,null,"A"]
["ALICE","Maria Alice  Moreira","Av. Tiradentes, 113","Centro","12334-000","Campo Belo ","MG","35-21345678","35-987543567","sil12@jmind.com.br","601.702.803-99","A"]
["ANA MARIA","Ana Maria de Souza","R. Arthur Bernardes, 431","Centro","13234-000","Campo Belo","MG","35-3264580","35-987564980","aninha45@terra.com.br","212.345.678-77","A"]
["BERENICE","Berenice Maria de Oliveira","R. Campos Salles, 121","Centro","18212-000","Itapetininga","SP","15-32712345","15-987657899","bereoliv@terra.com.br",null,"A"]
["CYRENIA","Cyrenia de Paulo","R. dos Trilhos 987","Centro","12343-000","Valinhos","SP","11-22334444","11-987354567","cydepaulo@uol.com.br","707.606.808-80","A"]
["HELOISA","Heloisa Maria de Andrade","R. Afonso Pena, 345","Centro","13245-800","Campo Belo","MG","35-12345678","35-98756789","helomo@uol.com.br","605.608.609-45","A"]
["JENNIFER ","Jennifer Aniston de Souza","R. das Flores, 655","Vila São José","13245-000","Caraguatatuba","SP","67-23456780","67-98756780","jennifer@gmail.com","608.607.606-90","A"]
["LÚCIO","João Lúcio Moreira","Av. Afonso Pena, 555","Centro","13225-000","Campo Belo ","MG","35-32745670","35-87654956","lucio223@uol.com.bf","709.657.888-00","A"]
["MARIA RITA","Maria Rita Kodama","R. das Estrelas, 456","V. São João","12322-900","Valinhos","SP","11-8763455","11-9875478","mari@terra.com.br","325.657.890-90","A"]
["ORLANDO","Orlando Bruno Pereira da Silva","R. Arthur Bernardes, 321","Centro","123345-888","Campo Belo ","MG","35-765599","35-987654567","orlandobruno@hotmail.com","123.432.567-88","A"]
["ZENITH","Zenith Aparecida Moreira","R. Parapuã, 1328","Itaberaba","11025-000","São Paulo","SP","11-997354812","11-997451234","zenith60@gmail.com","467.809.938-45","A"]

{"sheet":"MOVTO","index":6,"n_rows":14,"n_cols":15,"rows_kept":14,"cut":false,"hidden":false,"merged":[[0,0,0,1],[1,0,1,14]]}
[]
["HISTÓRICO DE MOVIMENTAÇÃO"]
["DATA","DOCUMENTO","PRODUTO","DESCRIÇÃO PRODUTO","UNID","OPERAÇÃO","CLIENTE/FORNECEDOR","QUANT.MOV","VALOR MOVTO","VALOR UNITÁRIO","SALDO QTDE","SALDO VALOR","CUSTO MÉDIO","VALOR VENDA","DESCRIÇÃO DA OPERAÇÃO"]
[]
["2024-01-20","NFE 4531","TACR001","TINTA ACRILICA PREMIUM - COR MARROM - GALÃO","LT","ENTRADA   COMPRA","ZENITH",30,550,18.333333333333332,90,2450,27.222222222222221,null,"compra realizada nesta data"]
["2024-01-26","NFV  0002","TACR001","TINTA ACRILICA PREMIUM - COR MARROM - GALÃO","LT","SAIDA VENDAS","ORLANDO",5,136.11111111111111,27.222222222222221,85,2313.8888888888887,27.222222222222221,230,"venda no dia "]
["2024-02-15","NFE-21/07","BA-023","CAIXA ACOPLADA PARA VASO SANITÁRIO","PC","ENTRADA   COMPRA","ORLANDO",10,2000,200,20,2800,140,null,"Entradas neste dia"]
["2024-02-25","req.003","BA-023","CAIXA ACOPLADA PARA VASO SANITÁRIO","PC","REQUISIÇÃO PRODUÇÃO","",3,420,140,17,2380,140,null,"requisição para manutençao"]
["2024-03-12","NFV 023","BA-023","CAIXA ACOPLADA PARA VASO SANITÁRIO","PC","SAIDA VENDAS","ZENITH",2,280,140,15,2100,140,300,"venda avulsa"]
["2024-03-20","req. uso interno","LAMLED-045","LAMPADA LED BULBO 220 V.","UN","REQUISIÇÃO PRODUÇÃO","_DIVERSOS",2,20.5,10.25,78,799.5,10.25,null,"troca de lampada"]
["2024-04-13","NFC-324","CH-P005","PISO CERAMICO MARMORIZADO","M2","ENTRADA   COMPRA","MARIA RITA",200,700,3.5,200,700,3.5,null,"Compra pela internet"]
["2024-04-13","NFC 324A","J003-XLS","GRIL ELÉTRICO GIRATÓRIO AÇO","PC","ENTRADA   COMPRA","HELOISA",25,600,24,47,13300,282.97872340425533,null,"Compra normal"]
["2024-04-13","NF-123","CH-P20-003","PORCELANATO CIMENTICIO","M2","ENTRADA   COMPRA","ANA MARIA",50,680,13.6,62,1340,21.612903225806452,null,"compra"]
["2024-04-13",2135,"COZ-003","CUBA COZINHA LUXO INOX","PC","ENTRADA   COMPRA","ALICE",5,790,158,15,3580,238.66666666666666]

{"sheet":"TABELAS","index":7,"n_rows":76,"n_cols":15,"rows_kept":76,"cut":false,"hidden":false,"merged":[[35,11,35,14],[46,11,46,12],[36,13,36,14],[38,13,38,14],[39,13,39,14],[40,13,40,14],[41,13,41,14],[42,13,42,14],[43,13,43,14],[44,13,44,14],[45,13,45,14],[46,13,46,14],[41,11,41,12],[42,11,42,12],[43,11,43,12],[44,11,44,12],[45,11,45,12],[36,11,36,12],[37,11,37,12],[38,11,38,12],[39,11,39,12],[40,11,40,12],[0,0,0,1],[2,0,2,1],[2,5,2,9],[0,2,0,13],[2,13,2,14]]}
[null,null,"MANUTENÇÃO DE TABELAS"]
[]
[" UNIDADES DE ESTOQUE",null,null,"GRUPOS DE PRODUTOS",null,"OPERAÇÕES DE ESTOQUE",null,null,null,null,null,"ESTADOS",null,"SITUAÇÃO"]
["DESCRIÇÃO","ABREV",null,"GRUPOS PRODUTO",null,"DESCRIÇÃO","ENT/SAIDA","VALORIZ","CONS VDA","CONS CPA",null,"AC",null,"ATIVO","A"]
["PEÇA","PC",null,"HIDRAULICOS",null,"ENTRADA   COMPRA","E",1,null,"S",null,"AL",null,"INATIVO","I"]
["CAIXA","CX",null,"JARDIM",null,"SAIDA VENDAS","S",2,"S",null,null,"AM"]
["METRO","MT",null,"TINTAS",null,"ENTRADA PRODUÇÃO","E",1,null,null,null,"AP"]
["UNIDADE","UN",null,"ELÉTRICO",null,"REQUISIÇÃO PRODUÇÃO","S",2,null,null,null,"BA"]
["KILO","KG",null,"ESCRITÓRIO",null,"DEVOLUÇÃO DE COMPRA","S",1,null,"S",null,"CE"]
["LITRO","LT",null,null,null,"DEVOLUÇÃO DE VENDA","E",1,"S",null,null,"DF"]
["METRO QUADRADO","M2",null,null,null,null,null,null,null,null,null,"ES"]
[null,null,null,null,null,null,null,null,null,null,null,"GO"]
[null,null,null,null,null,null,null,null,null,null,null,"MA"]
[null,null,null,null,null,null,null,null,null,null,null,"MG"]
[null,null,null,null,null,null,null,null,null,null,null,"MS"]
[null,null,null,null,null,null,null,null,null,null,null,"MT"]
[null,null,null,null,null,null,null,null,null,null,null,"PA"]
[null,null,null,null,null,null,null,null,null,null,null,"PB"]
[null,null,null,null,null,null,null,null,null,null,null,"PE"]
[null,null,null,null,null,null,null,null,null,null,null,"PI"]
[null,null,null,null,null,null,null,null,null,null,null,"PR"]
[null,null,null,null,null,null,null,null,null,null,null,"RJ"]
[null,null,null,null,null,null,null,null,null,null,null,"RN"]
[null,null,null,null,null,null,null,null,null,null,null,"RO"]
[null,null,null,null,null,null,null,null,null,null,null,"RR"]
[null,null,null,null,null,null,null,null,null,null,null,"RS"]
[null,null,null,null,null,null,null,null,null,null,null,"SC"]
[null,null,null,null,null,null,null,null,null,null,null,"SE"]
[null,null,null,null,null,null,null,null,null,null,null,"SP"]
[null,null,null,null,null,null,null,null,null,null,null,"TO"]
[]
[]
[]
[]
[]
[null,null,null,null,null,null,null,null,null,null,null,"TABELA DE USUÁRIOS"]
[null,null,null,null,null,null,null,null,null,null,null,"LOGIN",null,"SENHA"]
[null,null,null,null,null,null,null,null,null,null,null,"GERENTE",null,"abcd"]
[null,null,null,null,null,null,null,null,null,null,null,"JOAO",null,123]
[]
[]
[]
[]
[]
[]
[]
[]
[]
[]
[]
[]
[]
[]
[]
[]
[]
[]
[]
[]
[]
[]
[]
[]
[]
[]
[]
[]
["DATA",null,null,"DATA"]
["DOCUMENTO",null,null,"DOCUMENTO",null,"DATA"]
["PRODUTO",null,null,"PRODUTO",null,"DOCUMENTO"]
["OPERAÇÃO",null,null,"OPERAÇÃO",null,"PRODUTO"]
["QUANT.MOV",null,null,"QUANT.MOV",null,"OPERAÇÃO"]
["VALOR MOV",null,null,"VALOR MOV",null,"QUANT.MOV"]
["VALOR VENDA",null,null,"VALOR VENDA",null,"VALOR MOV"]
["DESCRIÇÃO MOV",null,null,"DESCRIÇÃO MOV",null,"VALOR VENDA"]
[null,null,null,null,null,"DESCRIÇÃO MOV"]

{"sheet":"DISP","index":8,"n_rows":9,"n_cols":10,"rows_kept":9,"cut":false,"hidden":true,"merged":[[0,1,0,5],[1,1,1,9],[2,1,2,5]]}
[]
[null," ANÁLISE DISPONIBILIDADE POR PRODUTO"]
[]
[null,"CODIGO","DESCRIÇÃO","UNID","QUANTIDADE EM ESTOQUE","QUANTIDADE A ENCOMENDAR","VALOR PREVISTO ENCOMENDA","ESTOQUE MINIMO","ESTOQUE MAXIMO","ALERTA/OBSERVAÇÃO"]
[null,"BA-023","CAIXA ACOPLADA PARA VASO SANITÁRIO","PC",15,0,0,null,10,"ESTOQUE ACIMA DO MAXIMO DESEJAVEL"]
[null,"CRGR-020","CORTADOR DE GRAMA MOD. CTA-020 - 220 V.","PC",5,0,0,null,0.8,"ESTOQUE ACIMA DO MAXIMO DESEJAVEL"]
[null,"LAMLED-045","LAMPADA LED BULBO 220 V.","UN",80,0,0,null,null,"OK"]
[null,"LULE- BK37","LUMINÁRIA LED BK37 BIVOLT","PC",12,0,0,null,null,"OK"]
[null,"TACR001","TINTA ACRILICA PREMIUM - COR MARROM - GALÃO","LT",85,0,0,null,null,"OK"]

{"sheet":"HIST_PRODUTO","index":9,"n_rows":6,"n_cols":9,"rows_kept":6,"cut":false,"hidden":false,"merged":[[0,1,0,5],[1,3,1,4]]}
[null,"HISTORICO DE MOVIMENTO POR PRODUTO",null,null,null,null,"Da Data:","2015-01-01"]
[null,"PRODUTO:","CH-P005","PISO CERAMICO MARMORIZADO",null,"M2","Até Data:","2024-04-13"]
[null,"DATA","NUMERO DO","TIPO DE ","CLIENTE  / FORNECEDOR","HISTÓRICO","QUANTIDADE","VALOR","VALOR"]
[null,"MOVIMENTO","DOCUMENTO","OPERAÇÃO",null,"(DESCRIÇÃO DA OPERAÇÃO)","MOVIMENTO","MOVIMENTO","VENDA"]
[]
[null,"2024-04-13","NFC-324","ENTRADA   COMPRA","MARIA RITA","Compra pela internet",200,700]

{"sheet":"ABC_PRODUTO","index":10,"n_rows":7,"n_cols":6,"rows_kept":7,"cut":false,"hidden":true,"merged":[[1,1,1,5],[0,1,0,5],[2,2,3,2]]}
[]
[null,"ANÁLISE A B C DE PRODUTOS -(base valor de vendas)"]
[null,null,null,"DA DATA:","2019-07-01"]
[null,null,null,"ATÉ A DATA:","2024-04-13"]
[null,"CODIGO PRODUTO","DESCRIÇÃO","VALOR VENDA","%","CLASS ABC"]
[null,null,null,null,null,"A"]
[null,null,null,null,null,"A"]

{"sheet":"ABC_CLIENTE","index":11,"n_rows":7,"n_cols":6,"rows_kept":7,"cut":false,"hidden":true,"merged":[[0,1,0,5],[1,1,1,5]]}
[]
[null,"ANÁLISE A B C DE CLIENTES -(base valor de vendas)"]
[null,null,null,"DA DATA:","2019-07-01"]
[null,null,null,"ATÉ A DATA:","2024-04-15"]
[null,"IDENTIFICAÇÃO","NOME DO CLIENTE","VALOR VENDA","%","CLASS ABC"]
[null,null,null,null,null,"A"]
[null,null,null,null,null,"A"]

{"sheet":"XX","index":12,"n_rows":0,"n_cols":0,"rows_kept":0,"cut":false,"hidden":false,"merged":[]}